{"text_format":"1","workbook":"xlsx","n_sheets":4,"sheets":["Instructions","Minimum Pipe Cover & Angle Work","Storm Drain Pipe Schedule","Resources"],"not_rendered":{"charts":0,"images":4,"macros":1,"external_links":0,"defined_names":14,"comments":0,"pivot_tables":0},"unopened":[],"bounds":{"document_bytes":16777216,"sheet_cells":100000,"rows_first":2000,"rows_last":500,"rows_between":2000,"halvings":0,"cell_chars":16384,"cell_head_chars":4096},"cells_cut":0,"cells_raw":0,"read":"whole","date_system":"1900"}

{"sheet":"Instructions","index":0,"n_rows":30,"n_cols":4,"rows_kept":30,"cut":false,"hidden":false,"merged":[[32,0,32,3],[28,0,28,3],[27,0,27,3],[8,0,8,3],[9,0,9,3],[24,0,24,3],[1,0,1,3],[2,0,2,3],[5,0,5,3],[6,0,6,3],[7,0,7,3],[3,0,3,3]]}
[]
["Minimum Cover/Maximum Angle Worksheet"]
["Disclaimer: This program should only be used for quality control of storm water systems for proposed projects. It is the responsibility of the engineer, not DelDOT, to ensure that all connection locations meet the Department's standards. Errors found after plan approval or during construction will be corrected at the applicant's expense."]
["Class IV or V reinforced concrete pipe may be used in accordance with AASHTO design standards where the cover is shallower than the minimum cover for class III. Information in this worksheet is for guidance only."]
[]
[]
[]
[]
[]
[]
{"$rows_left_out":21}
{"sheet":"Minimum Pipe Cover & Angle Work","index":1,"n_rows":98,"n_cols":93,"rows_kept":98,"cut":false,"hidden":false,"merged":[[96,0,97,0],[96,1,97,1],[96,2,97,2],[96,3,97,3],[96,5,97,5],[96,6,97,6],[96,7,97,7],[96,33,97,33],[96,36,97,36],[94,0,95,0],[94,1,95,1],[94,2,95,2],[94,3,95,3],[94,5,95,5],[94,6,95,6],[94,7,95,7],[94,33,95,33],[94,36,95,36],[92,0,93,0],[92,1,93,1],[92,2,93,2],[92,3,93,3],[92,5,93,5],[92,6,93,6],[92,7,93,7],[92,33,93,33],[92,36,93,36],[90,0,91,0],[90,1,91,1],[90,2,91,2],[90,3,91,3],[90,5,91,5],[90,6,91,6],[90,7,91,7],[90,33,91,33],[90,36,91,36],[88,0,89,0],[88,1,89,1],[88,2,89,2],[88,3,89,3],[88,5,89,5],[88,6,89,6],[88,7,89,7],[88,33,89,33],[88,36,89,36],[86,0,87,0],[86,1,87,1],[86,2,87,2],[86,3,87,3],[86,5,87,5],[86,6,87,6],[86,7,87,7],[86,33,87,33],[86,36,87,36],[84,0,85,0],[84,1,85,1],[84,2,85,2],[84,3,85,3],[84,5,85,5],[84,6,85,6],[84,7,85,7],[84,33,85,33],[84,36,85,36],[82,0,83,0],[82,1,83,1],[82,2,83,2],[82,3,83,3],[82,5,83,5],[82,6,83,6],[82,7,83,7],[82,33,83,33],[82,36,83,36],[80,0,81,0],[80,1,81,1],[80,2,81,2],[80,3,81,3],[80,5,81,5],[80,6,81,6],[80,7,81,7],[80,33,81,33],[80,36,81,36],[78,0,79,0],[78,1,79,1],[78,2,79,2],[78,3,79,3],[78,5,79,5],[78,6,79,6],[78,7,79,7],[78,33,79,33],[78,36,79,36],[76,0,77,0],[76,1,77,1],[76,2,77,2],[76,3,77,3],[76,5,77,5],[76,6,77,6],[76,7,77,7],[76,33,77,33],[76,36,77,36],[74,0,75,0],[74,1,75,1],[74,2,75,2],[74,3,75,3],[74,5,75,5],[74,6,75,6],[74,7,75,7],[74,33,75,33],[74,36,75,36],[72,0,73,0],[72,1,73,1],[72,2,73,2],[72,3,73,3],[72,5,73,5],[72,6,73,6],[72,7,73,7],[72,33,73,33],[72,36,73,36],[0,0,2,36],[70,0,71,0],[70,1,71,1],[70,2,71,2],[70,3,71,3],[70,5,71,5],[70,6,71,6],[70,7,71,7],[70,33,71,33],[70,36,71,36],[68,0,69,0],[68,1,69,1],[68,2,69,2],[68,3,69,3],[68,5,69,5],[68,6,69,6],[68,7,69,7],[68,33,69,33],[68,36,69,36],[66,0,67,0],[66,1,67,1],[66,2,67,2],[66,3,67,3],[66,5,67,5],[66,6,67,6],[66,7,67,7],[66,33,67,33],[66,36,67,36],[64,0,65,0],[64,1,65,1],[64,2,65,2],[64,3,65,3],[64,5,65,5],[64,6,65,6],[64,7,65,7],[64,33,65,33],[64,36,65,36],[62,0,63,0],[62,1,63,1],[62,2,63,2],[62,3,63,3],[62,5,63,5],[62,6,63,6],[62,7,63,7],[62,33,63,33],[62,36,63,36],[60,0,61,0],[60,1,61,1],[60,2,61,2],[60,3,61,3],[60,5,61,5],[60,6,61,6],[60,7,61,7],[60,33,61,33],[60,36,61,36],[58,0,59,0],[58,1,59,1],[58,2,59,2],[58,3,59,3],[58,5,59,5],[58,6,59,6],[58,7,59,7],[58,33,59,33],[58,36,59,36],[56,0,57,0],[56,1,57,1],[56,2,57,2],[56,3,57,3],[56,5,57,5],[56,6,57,6],[56,7,57,7],[56,33,57,33],[56,36,57,36],[54,0,55,0],[54,1,55,1],[54,2,55,2],[54,3,55,3],[54,5,55,5],[54,6,55,6],[54,7,55,7],[54,33,55,33],[54,36,55,36],[52,0,53,0],[52,1,53,1],[52,2,53,2],[52,3,53,3],[52,5,53,5],[52,6,53,6],[52,7,53,7],[52,33,53,33],[52,36,53,36],[46,36,47,36],[48,36,49,36],[50,36,51,36],[4,0,4,4],[4,18,4,22],[40,33,41,33],[42,33,43,33],[44,33,45,33],[46,33,47,33],[48,33,49,33],[50,33,51,33],[10,36,11,36],[12,36,13,36],[14,36,15,36],[16,36,17,36],[18,36,19,36],[20,36,21,36],[22,36,23,36],[24,36,25,36],[26,36,27,36],[28,36,29,36],[30,36,31,36],[32,36,33,36],[34,36,35,36],[40,36,41,36],[42,36,43,36],[44,36,45,36],[24,33,25,33],[8,36,9,36],[26,33,27,33],[28,33,29,33],[30,33,31,33],[32,33,33,33],[34,33,35,33],[36,33,37,33],[38,33,39,33],[10,33,11,33],[12,33,13,33],[14,33,15,33],[16,33,17,33],[18,33,19,33],[20,33,21,33],[22,33,23,33],[36,36,37,36],[38,36,39,36],[50,0,51,0],[50,1,51,1],[50,2,51,2],[50,3,51,3],[50,5,51,5],[50,6,51,6],[50,7,51,7],[48,0,49,0],[48,1,49,1],[48,2,49,2],[48,3,49,3],[48,5,49,5],[48,6,49,6],[44,7,45,7],[46,0,47,0],[46,1,47,1],[46,2,47,2],[46,3,47,3],[46,5,47,5],[48,7,49,7],[46,6,47,6],[46,7,47,7],[44,0,45,0],[44,1,45,1],[44,2,45,2],[44,3,45,3],[44,5,45,5],[44,6,45,6],[38,0,39,0],[38,1,39,1],[36,2,37,2],[38,2,39,2],[28,6,29,6],[34,1,35,1],[36,1,37,1],[36,3,37,3],[36,5,37,5],[28,0,29,0],[30,0,31,0],[30,1,31,1],[28,1,29,1],[30,2,31,2],[32,2,33,2],[28,2,29,2],[36,0,37,0],[32,0,33,0],[32,1,33,1],[34,0,35,0],[34,2,35,2],[28,3,29,3],[28,5,29,5],[32,5,33,5],[42,0,43,0],[42,1,43,1],[42,2,43,2],[42,3,43,3],[42,5,43,5],[42,6,43,6],[42,7,43,7],[40,0,41,0],[40,1,41,1],[40,2,41,2],[40,3,41,3],[40,5,41,5],[40,6,41,6],[40,7,41,7],[34,6,35,6],[34,3,35,3],[34,5,35,5],[36,7,37,7],[30,5,31,5],[36,6,37,6],[30,6,31,6],[38,3,39,3],[38,5,39,5],[38,6,39,6],[38,7,39,7],[32,6,33,6],[32,7,33,7],[30,3,31,3],[24,65,24,75],[26,63,37,63],[18,6,19,6],[18,7,19,7],[18,2,19,2],[26,6,27,6],[26,7,27,7],[30,7,31,7],[20,0,21,0],[20,1,21,1],[20,3,21,3],[20,5,21,5],[24,6,25,6],[24,7,25,7],[22,0,23,0],[22,1,23,1],[22,3,23,3],[22,5,23,5],[24,0,25,0],[24,1,25,1],[24,5,25,5],[20,2,21,2],[22,2,23,2],[20,6,21,6],[9,63,15,63],[8,1,9,1],[10,6,11,6],[10,7,11,7],[12,6,13,6],[12,7,13,7],[14,6,15,6],[14,7,15,7],[12,1,13,1],[12,3,13,3],[12,5,13,5],[10,2,11,2],[14,2,15,2],[14,1,15,1],[14,3,15,3],[14,5,15,5],[10,62,35,62],[18,5,19,5],[10,5,11,5],[26,2,27,2],[22,7,23,7],[26,1,27,1],[26,3,27,3],[26,5,27,5],[4,34,4,36],[3,0,3,1],[5,20,7,20],[5,30,7,30],[18,0,19,0],[18,1,19,1],[18,3,19,3],[16,3,17,3],[16,5,17,5],[16,2,17,2],[16,6,17,6],[16,7,17,7],[16,1,17,1],[10,0,11,0],[14,0,15,0],[16,0,17,0],[5,33,7,33],[5,34,7,34],[5,36,7,36],[5,31,7,31],[5,35,7,35],[8,33,9,33],[10,1,11,1],[10,3,11,3],[3,20,3,21],[98,0,99,0],[98,1,99,1],[98,2,99,2],[98,3,99,3],[98,5,99,5],[98,6,99,6],[98,7,99,7],[20,7,21,7],[22,6,23,6],[12,2,13,2],[12,0,13,0],[8,0,9,0],[8,3,9,3],[8,5,9,5],[4,8,4,12],[3,15,3,17],[34,7,35,7],[32,3,33,3],[3,2,3,10],[26,0,27,0],[24,3,25,3],[24,2,25,2],[28,7,29,7],[5,22,7,22],[4,30,4,33],[8,6,9,6],[8,7,9,7],[5,21,7,21],[5,0,7,0],[5,1,7,1],[5,2,7,2],[5,3,7,3],[5,15,7,15],[5,17,7,17],[5,18,7,18],[5,32,7,32],[4,15,4,17],[8,2,9,2],[4,13,4,14],[98,36,99,36],[100,0,101,0],[100,1,101,1],[100,2,101,2],[100,3,101,3],[100,5,101,5],[100,6,101,6],[100,7,101,7],[100,33,101,33],[100,36,101,36],[98,33,99,33],[102,0,103,0],[102,1,103,1],[102,2,103,2],[102,3,103,3],[102,5,103,5],[102,6,103,6],[102,7,103,7],[102,33,103,33],[102,36,103,36],[104,0,105,0],[104,1,105,1],[104,2,105,2],[104,3,105,3],[104,5,105,5],[104,6,105,6],[104,7,105,7],[104,33,105,33],[104,36,105,36],[106,0,107,0],[106,1,107,1],[106,2,107,2],[106,3,107,3],[106,5,107,5],[106,6,107,6],[106,7,107,7],[106,33,107,33],[106,36,107,36],[108,0,109,0],[108,1,109,1],[108,2,109,2],[108,3,109,3],[108,5,109,5],[108,6,109,6],[108,7,109,7],[108,33,109,33],[108,36,109,36],[110,0,111,0],[110,1,111,1],[110,2,111,2],[110,3,111,3],[110,5,111,5],[110,6,111,6],[110,7,111,7],[110,33,111,33],[110,36,111,36],[112,0,113,0],[112,1,113,1],[112,2,113,2],[112,3,113,3],[112,5,113,5],[112,6,113,6],[112,7,113,7],[112,33,113,33],[112,36,113,36],[114,0,115,0],[114,1,115,1],[114,2,115,2],[114,3,115,3],[114,5,115,5],[114,6,115,6],[114,7,115,7],[114,33,115,33],[114,36,115,36],[116,0,117,0],[116,1,117,1],[116,2,117,2],[116,3,117,3],[116,5,117,5],[116,6,117,6],[116,7,117,7],[116,33,117,33],[116,36,117,36],[118,0,119,0],[118,1,119,1],[118,2,119,2],[118,3,119,3],[118,5,119,5],[118,6,119,6],[118,7,119,7],[118,33,119,33],[118,36,119,36],[120,0,121,0],[120,1,121,1],[120,2,121,2],[120,3,121,3],[120,5,121,5],[120,6,121,6],[120,7,121,7],[120,33,121,33],[120,36,121,36],[122,0,123,0],[122,1,123,1],[122,2,123,2],[122,3,123,3],[122,5,123,5],[122,6,123,6],[122,7,123,7],[122,33,123,33],[122,36,123,36],[124,0,125,0],[124,1,125,1],[124,2,125,2],[124,3,125,3],[124,5,125,5],[124,6,125,6],[124,7,125,7],[124,33,125,33],[124,36,125,36],[126,0,127,0],[126,1,127,1],[126,2,127,2],[126,3,127,3],[126,5,127,5],[126,6,127,6],[126,7,127,7],[126,33,127,33],[126,36,127,36],[128,0,129,0],[128,1,129,1],[128,2,129,2],[128,3,129,3],[128,5,129,5],[128,6,129,6],[128,7,129,7],[128,33,129,33],[128,36,129,36],[130,0,131,0],[130,1,131,1],[130,2,131,2],[130,3,131,3],[130,5,131,5],[130,6,131,6],[130,7,131,7],[130,33,131,33],[130,36,131,36]]}
["Minimum Cover / Maximum Angle Worksheet for RCP and HDPE",null,null,null,null,null,null,null,null,null,null,null,null,null,null,null,null,null,null,null,null,null,null,null,null,null,null,null,null,null,null,null,null,null,null,null,null,null,null,null,"RCP","III"]
[null,null,null,null,null,null,null,null,null,null,null,null,null,null,null,null,null,null,null,null,null,null,null,null,null,null,null,null,null,null,null,null,null,null,null,null,null,null,null,null,"ERCP","IV"]
[null,null,null,null,null,null,null,null,null,null,null,null,null,null,null,null,null,null,null,null,null,null,null,null,null,null,null,null,null,null,null,null,null,null,null,null,null,null,null,null,"HDPE","V"]
["Project Name:",null,"Project Name",null,null,null,null,null,null,null,null,null,null,null,null,null,null,null,"Date:"]
["Pipe Information",null,null,null,null,null,null,null,"Inlet / Structure Information",null,null,null,null,"Top Unit Application",null,"Angles",null,null,"Cover Requirements",null,null,null,null,null,null,null,null,null,null,null,"RCP",null,null,null,"HDPE",null,null,null,null,null,"Pipe Size","Equiv Diameter","Conc Thickness","HDPE Thickness","Actual Size",null,null,null,null,null,null,null,null,null,"RCP Actual Size Chart"]
["Pipe ID","Pipe Material","Pipe Length (Ft.)","Pipe Size (in.)","Pipe Invert Elev.","Equiv. Pipe Diam. (in.)","Actual Size (in.)","Pipe Thickness (in.)","Structure ID","Structure Top Unit Type","T.G. Elevation ","Structure Size ","Str. Wall Width ","Curb Type/ Swale/ Pavement","Curb /Top Unit Compatible","Maximum Angle Allowed ","Actual Angle ","Meets Allowable Angle","Coverage Required For Inlet or MH(in.)","Min. Invert Elevation","Meets Min. Cover for Structure","Pavement Type","Pavement Depth to Top of Base Course (in)","Rigid Cover Complinace RCP","Flexible Cover Compliance RCP","Rigid Cover Compliance HDPE","Flexible Cover Compliance HDPE","Class IV Guidance Only","Class V Guidance Only","Top of Pipe Elevation","Meets Min. Cover for Class III RCP (DGM 1-20)","Calculated Cover (ft)","Class IV or V RCP (For Guidance Only) ","Pipe Class Selected Based on LRFD / ACPA","Meets Min. Cover for Standard HDPE (DGM1-20)","Calculated Cover (ft)","Manufacturer Required HDPE",null,null,"RCP",12,"-",2,null,12,null,"Inlet ","Side 1","Side 2","Coverage Required",null,"Inlet Size Master List",null,"Inlet Top Unit Type","Pipe Size","Equiv Dia","Conc Thickness","Actual Size",null,null,null,null,null,null,null,"RCP Pipe Sizes (with Wall Thickness)",null,null,null,null,null,null,null,null,null,null,null,null,null,null,"ERCP Pipe Sizes (with Wall Thickness)"]
[null,null,null,null,"US",null,null,null,"US","US","US","US","US","US","US",null,"US",null,null,"Upstream",null,null,null,"Upstream","Upstream","Upstream","Upstream","Upstream","Upstream","Upstream"]
[null,null,null,null,"DS",null,null,null,"DS","DS","DS","DS","DS","DS","DS",null,"DS",null,null,"Downstream",null,null,null,"Downstream","Downstream","Downstream","Downstream","Downstream","Downstream","Downstream"]
["P-100","RCP",45,15,100,{"$f":"LOOKUP(D9,$AO$6:$AP$32)","v":"-"},{"$f":"IF($B9=\"RCP\",LOOKUP($D9,$AO$6:$AO$33,$AS$6:$AS$33),IF($B9=\"ERCP\",LOOKUP($D9,$AO$6:$AO$33,$AS$6:$AS$33),LOOKUP($D9,$AO$35:$AO$48,$AR$35:$AR$48)))","v":15},{"$f":"IF($B9=\"RCP\",LOOKUP($D9,$AO$6:$AO$33,$AQ$6:$AQ$33),IF($B9=\"ERCP\",LOOKUP($D9,$AO$6:$AO$33,$AQ$6:$AQ$33),LOOKUP($D9,$AO$35:$AO$48,$AQ$35:$AQ$48)))","v":2.25},"DI-100","B",110,"34\"x24\"",24,"IPCC 1-4",{"$f":"IF(N9<>\"\", INDEX(BN61:CC68, MATCH(J9,BM$61:BM$68,),MATCH(N9,BN$60:CC$60,)),\" \")","v":"NO"},{"$f":"IF(B9=\"RCP\",INDEX($BM$9:$CA$21,MATCH(M9,$BM$9:$BM$21,),MATCH(D9,$BM$9:$CA$9,)),IF(B9=\"ERCP\",INDEX($CB$9:$CO$21,MATCH(M9,$CB$9:$CB$21,),MATCH(D9,$CB$9:$CO$9,)),INDEX($BM$26:$BY$38,MATCH(M9,$BM$26:$BM$37,),MATCH(D9,$BM$26:$BY$26,))))","v":4.25},null,{"$f":"IF(P9=\"N/A\",\"NO\",IF(P9>=Q9,\"YES\",\"NO\"))","v":"YES"},{"$f":"INDEX(BD$36:BJ$58,MATCH(L9,BC$36:BC$58,),MATCH(J9,BD$35:BJ$35,))","v":10},{"$f":"K9-((G9+H9+S9)/12)","v":107.73},{"$f":"IF(E9<=T9,\"YES\",\"NO\")","v":"YES"},null,null,{"$f":"IF(AND($V9=\"Rigid\",($K9-(($W9/12)+0.75)>=$AD9)),  \"YES\",\"NO\")","v":"NO"},{"$f":"IF(AND($V9=\"Flexible\",(($K9-1)>=$AD9)),\"YES\",\"NO\")","v":"NO"},{"$f":"IF(AND($V9=\"Rigid\",($K9-2>=$AD9)),  \"YES\",\"NO\")","v":"NO"},{"$f":"IF(AND($V9=\"Flexible\",($K9-(($W9/12)+1)>=$AD9)),  \"YES\",\"NO\")","v":"NO"},{"$f":"IF($K9-(($W9/12)+0.5)>=$AD9,  \"YES\",\"NO\")","v":"YES"},{"$f":"IF($K9-(($W9/12))>=$AD9,  \"YES\",\"NO\")","v":"YES"},{"$f":"E9+((G9+H9)/12)","v":101.44},{"$f":"IF($B9=\"HDPE\",\"\",IF(V9=\"Rigid\",X9,Y9))","v":"NO"},{"$f":"IF(AE9=\"\",\"\",K9-AD9)","v":8.56},{"$f":"IF($B9=\"HDPE\",\"\",IF($AE9=\"YES\",\"\",IF(AB9=\"YES\",\"IV\",IF(AC9=\"YES\",\"V\",\"NO\"))))","v":"IV"},null,{"$f":"IF($B9=\"HDPE\",IF(V9=\"Rigid\",Z9,AA9),\"\")","v":""},{"$f":"IF(AI9=\"\",\"\",K9-AD9)","v":""},null,null,null,null,15,"-",2.25,1.2849999999999999,15,null,0,"-","-",0,null,0,0,"A",12,12,2,{"$f":"BD9+(BE9*2)","v":16},null,"Inlet Size",null,null,null,null,null,0,12,15,18,21,24,27,30,33,36,42,48,54,60,null,"14\"x23\"","19\"x30\"","22\"x34\"","24\"x38\"","27\"x42\"","29\"x45\"","32\"x49\"","34\"x53\"","38\"x60\"","43\"x68\"","48\"x76\"","53\"x83\"","58\"x91\""]
[null,null,null,null,98.5,null,null,null,"DI-101","C",101,"66\"x48\"",48,"PCC 1-2","NO",{"$f":"IF(B9=\"RCP\",INDEX($BM$9:$CA$21,MATCH(M10,$BM$9:$BM$21,),MATCH(D9,$BM$9:$CA$9,)),IF(B9=\"ERCP\",INDEX($CB$9:$CO$21,MATCH(M10,$CB$9:$CB$21,),MATCH(D9,$CB$9:$CO$9,)),INDEX($BM$26:$BY$38,MATCH(M10,$BM$26:$BM$37,),MATCH(D9,$BM$26:$BY$26,))))","v":56.19},null,"YES",18,{"$f":"K10-((G9+H9+S10)/12)","v":98.06},{"$f":"IF(E10<=T10,\"YES\",\"NO\")","v":"NO"},null,null,{"$f":"IF(AND($V10=\"Rigid\",($K10-(($W10/12)+0.75)>=$AD10)),  \"YES\",\"NO\")","v":"NO"},"NO",{"$f":"IF(AND($V10=\"Rigid\",($K10-2>=$AD10)),  \"YES\",\"NO\")","v":"NO"},{"$f":"IF(AND($V10=\"Flexible\",($K10-(($W10/12)+1)>=$AD10)),  \"YES\",\"NO\")","v":"NO"},{"$f":"IF($K10-(($W10/12)+0.5)>=$AD10,  \"YES\",\"NO\")","v":"YES"},{"$f":"IF($K10-(($W10/12))>=$AD10,  \"YES\",\"NO\")","v":"YES"},{"$f":"E10+((G9+H9)/12)","v":99.94},{"$f":"IF($B9=\"HDPE\",\"\",IF(V10=\"Rigid\",X10,Y10))","v":"NO"},{"$f":"IF(AE10=\"\",\"\",K10-AD10)","v":1.06},"IV",null,{"$f":"IF($B9=\"HDPE\",IF(V10=\"Rigid\",Z10,AA10),\"\")","v":""},"",null,null,null,null,18,"-",2.5,1.6,18,null,"34\"x18\"",34,18,10,null,null,null,"B",15,15,2.25,{"$f":"BD10+(BE10*2)","v":19.5},null,0,null,null,null,"Inlet Wall Size",18,0,"N/A","N/A","N/A","N/A","N/A","N/A","N/A","N/A","N/A","N/A","N/A","N/A","N/A",18,"N/A","N/A","N/A","N/A","N/A","N/A","N/A","N/A","N/A","N/A","N/A","N/A","N/A"]
{"$rows_left_out":89}
{"sheet":"Storm Drain Pipe Schedule","index":2,"n_rows":25,"n_cols":10,"rows_kept":25,"cut":false,"hidden":false,"merged":[[0,0,0,9],[1,8,1,9],[1,1,1,7],[1,0,2,0]]}
["Storm Drainage Pipe Schedule (DCM Figure 4.3.5-c)"]
["Pipe ","Description",null,null,null,null,null,null,"Invert Elevation"]
[null,"From","To","Size","Type","Length","Class","Slope (%)","In","Out"]
[{"$f":"'Minimum Pipe Cover & Angle Work'!A9","v":"P-100"},{"$f":"'Minimum Pipe Cover & Angle Work'!I9","v":"DI-100"},{"$f":"'Minimum Pipe Cover & Angle Work'!I10","v":"DI-101"},{"$f":"'Minimum Pipe Cover & Angle Work'!D9","v":15},{"$f":"'Minimum Pipe Cover & Angle Work'!B9","v":"RCP"},{"$f":"'Minimum Pipe Cover & Angle Work'!C9","v":45},{"$f":"IF(F4=\"HDPE\",\"\",'Minimum Pipe Cover & Angle Work'!AH9)","v":0},{"$f":"IF(F4>0,((I4-J4)/F4)*100,0)","v":3.33},{"$f":"'Minimum Pipe Cover & Angle Work'!E9","v":100},{"$f":"'Minimum Pipe Cover & Angle Work'!E10","v":98.5}]
[{"$f":"'Minimum Pipe Cover & Angle Work'!A11","v":0},{"$f":"'Minimum Pipe Cover & Angle Work'!I11","v":0},{"$f":"'Minimum Pipe Cover & Angle Work'!I12","v":0},{"$f":"'Minimum Pipe Cover & Angle Work'!D11","v":0},{"$f":"'Minimum Pipe Cover & Angle Work'!B11","v":0},{"$f":"'Minimum Pipe Cover & Angle Work'!C11","v":0},{"$f":"IF(F5=\"HDPE\",\"\",'Minimum Pipe Cover & Angle Work'!AH11)","v":0},0,{"$f":"'Minimum Pipe Cover & Angle Work'!E11","v":0},{"$f":"'Minimum Pipe Cover & Angle Work'!E12","v":0}]
[{"$f":"'Minimum Pipe Cover & Angle Work'!A13","v":0},{"$f":"'Minimum Pipe Cover & Angle Work'!I13","v":0},{"$f":"'Minimum Pipe Cover & Angle Work'!I14","v":0},{"$f":"'Minimum Pipe Cover & Angle Work'!D13","v":0},{"$f":"'Minimum Pipe Cover & Angle Work'!B13","v":0},{"$f":"'Minimum Pipe Cover & Angle Work'!C13","v":0},{"$f":"IF(F6=\"HDPE\",\"\",'Minimum Pipe Cover & Angle Work'!AH13)","v":0},0,{"$f":"'Minimum Pipe Cover & Angle Work'!E13","v":0},{"$f":"'Minimum Pipe Cover & Angle Work'!E14","v":0}]
[{"$f":"'Minimum Pipe Cover & Angle Work'!A15","v":0},{"$f":"'Minimum Pipe Cover & Angle Work'!I15","v":0},{"$f":"'Minimum Pipe Cover & Angle Work'!I16","v":0},{"$f":"'Minimum Pipe Cover & Angle Work'!D15","v":0},{"$f":"'Minimum Pipe Cover & Angle Work'!B15","v":0},{"$f":"'Minimum Pipe Cover & Angle Work'!C15","v":0},{"$f":"IF(F7=\"HDPE\",\"\",'Minimum Pipe Cover & Angle Work'!AH15)","v":0},0,{"$f":"'Minimum Pipe Cover & Angle Work'!E15","v":0},{"$f":"'Minimum Pipe Cover & Angle Work'!E16","v":0}]
[{"$f":"'Minimum Pipe Cover & Angle Work'!A17","v":0},{"$f":"'Minimum Pipe Cover & Angle Work'!I17","v":0},{"$f":"'Minimum Pipe Cover & Angle Work'!I18","v":0},{"$f":"'Minimum Pipe Cover & Angle Work'!D17","v":0},{"$f":"'Minimum Pipe Cover & Angle Work'!B17","v":0},{"$f":"'Minimum Pipe Cover & Angle Work'!C17","v":0},{"$f":"IF(F8=\"HDPE\",\"\",'Minimum Pipe Cover & Angle Work'!AH17)","v":0},0,{"$f":"'Minimum Pipe Cover & Angle Work'!E17","v":0},{"$f":"'Minimum Pipe Cover & Angle Work'!E18","v":0}]
[{"$f":"'Minimum Pipe Cover & Angle Work'!A19","v":0},{"$f":"'Minimum Pipe Cover & Angle Work'!I19","v":0},{"$f":"'Minimum Pipe Cover & Angle Work'!I20","v":0},{"$f":"'Minimum Pipe Cover & Angle Work'!D19","v":0},{"$f":"'Minimum Pipe Cover & Angle Work'!B19","v":0},{"$f":"'Minimum Pipe Cover & Angle Work'!C19","v":0},{"$f":"IF(F9=\"HDPE\",\"\",'Minimum Pipe Cover & Angle Work'!AH19)","v":0},0,{"$f":"'Minimum Pipe Cover & Angle Work'!E19","v":0},{"$f":"'Minimum Pipe Cover & Angle Work'!E20","v":0}]
[{"$f":"'Minimum Pipe Cover & Angle Work'!A21","v":0},{"$f":"'Minimum Pipe Cover & Angle Work'!I21","v":0},{"$f":"'Minimum Pipe Cover & Angle Work'!I22","v":0},{"$f":"'Minimum Pipe Cover & Angle Work'!D21","v":0},{"$f":"'Minimum Pipe Cover & Angle Work'!B21","v":0},{"$f":"'Minimum Pipe Cover & Angle Work'!C21","v":0},{"$f":"IF(F10=\"HDPE\",\"\",'Minimum Pipe Cover & Angle Work'!AH21)","v":0},0,{"$f":"'Minimum Pipe Cover & Angle Work'!E21","v":0},{"$f":"'Minimum Pipe Cover & Angle Work'!E22","v":0}]
{"$rows_left_out":16}
{"sheet":"Resources","index":3,"n_rows":9,"n_cols":1,"rows_kept":9,"cut":false,"hidden":false,"merged":[[32,0,32,3],[1,0,1,3],[2,0,2,3],[5,0,5,3],[6,0,6,3],[7,0,7,3],[8,0,8,3]]}
[]
["Resources"]
[]
[]
[]
[]
[]
[]
["(Figure from Standard Detail D-5 (2012) -3)"]